“In file included from psycopg/psycopgmodule.c:28:./psycopg/psycopg.h:35:10: fatal error: Python.h: No such file or directory35 | #include <Python.h>| ^~~~~~~~~~compilation terminated.” Code Answer’s


In file included from psycopg/psycopgmodule.c:28:./psycopg/psycopg.h:35:10: fatal error: Python.h: No such file or directory35 | #include | ^~~~~~~~~~compilation terminated.
python by Bug Killer         on Nov 05 2020 Donate Comment
0
In file included from psycopg/psycopgmodule.c:28:./psycopg/psycopg.h:35:10: fatal error: Python.h: No such file or directory35 | #include | ^~~~~~~~~~compilation terminated.
python by Bug Killer         on Nov 05 2020 Donate Comment
0
Add a Grepper Answer

Python answers related to “In file included from psycopg/psycopgmodule.c:28:./psycopg/psycopg.h:35:10: fatal error: Python.h: No such file or directory35 | #include <Python.h>| ^~~~~~~~~~compilation terminated.”


Python queries related to “In file included from psycopg/psycopgmodule.c:28:./psycopg/psycopg.h:35:10: fatal error: Python.h: No such file or directory35 | #include <Python.h>| ^~~~~~~~~~compilation terminated.”




Browse Python Answers by Framework


More “Kinda” Related Python Answers View All Python Answers »




Browse Popular Code Answers by Language




Browse Other Code Languages




X

Continue with Google

By continuing, I agree that I have read and agree to Greppers's Terms of Service and Privacy Policy.
X
Grepper Account Login Required

Oops, You will need to install Grepper and log-in to perform this action.