“Uncaught ErrorException: preg_match_all(): Compilation failed: unrecognised compile-time option bit(s) at offset 0” Code Answer


Uncaught ErrorException: preg_match_all(): Compilation failed: unrecognised compile-time option bit(s) at offset 0
whatever by Sanjaya         on Nov 23 2021 Comment
1
Add a Grepper Answer

Whatever answers related to “Uncaught ErrorException: preg_match_all(): Compilation failed: unrecognised compile-time option bit(s) at offset 0”


Whatever queries related to “Uncaught ErrorException: preg_match_all(): Compilation failed: unrecognised compile-time option bit(s) at offset 0”





More “Kinda” Related Whatever Answers View All Whatever Answers »




Browse Popular Code Answers by Language




Browse Other Code Languages




X

Continue with Google

By continuing, I agree that I have read and agree to Greppers's Terms of Service and Privacy Policy.
X
Grepper Account Login Required

Oops, You will need to install Grepper and log-in to perform this action.